{"text_format":"1","workbook":"xlsx","n_sheets":6,"sheets":["1. INSTRUCTIONS","2. Coûts admissibles & non adm.","3. Budget - Plan de travail","4. Sources de financement","5. Tableau paiements & rapports","6. Demandes de remboursement"],"not_rendered":{"charts":0,"images":0,"macros":1,"external_links":0,"defined_names":13,"comments":0,"pivot_tables":0},"unopened":[],"bounds":{"document_bytes":16777216,"sheet_cells":100000,"rows_first":2000,"rows_last":500,"rows_between":2000,"halvings":0,"cell_chars":16384,"cell_head_chars":4096},"cells_cut":0,"cells_raw":0,"read":"whole","date_system":"1900"}

{"sheet":"1. INSTRUCTIONS","index":0,"n_rows":11,"n_cols":1,"rows_kept":11,"cut":false,"hidden":false,"merged":[]}
["PLAN DE TRAVAIL ET BUDGET – Plan, étude ou projet pilote du Fonds municipal vert"]
["INSTRUCTIONS – VEUILLEZ EN PRENDRE CONNAISSANCE AVANT DE REMPLIR LE FORMULAIRE"]
["Macros : Le présent modèle utilise des « macros », qui sont des groupes d'instructions programmées dont l'objectif principal est d'automatiser les tâches. Les macros déclenchent les clauses appropriées dans ce plan de travail et ce budget. Pour utiliser toutes les fonctionnalités de ce modèle, vous devez activer les macros dans Excel. \nSauvegarde du modèle : Il est essentiel de sauvegarder le modèle correctement, faute de quoi les informations exactes pourraient ne pas être enregistrées. Au moment de sauvegarder le modèle, assurez-vous de sélectionner « Classeur Excel (prenant en charge les macros) » (*.xlsm)."]
["Pour présenter une demande au Fonds municipal vert (FMV), vous devez lire, comprendre et remplir les onglets 1 à 4. Il vous faut mettre à jour les onglets 4 à 6 tout au long de l'initiative et à chaque contribution demandée au FMV. Notez que les onglets 5 et 6 vous seront fournis uniquement une fois que le financement de votre demande aura été approuvé, car le FMV utilise ces onglets pour suivre les progrès réalisés par votre initiative."]
["▪ ÉTAPE : Une étape est un livrable important témoignant de l'achèvement d'une ou de plusieurs tâches. Les versements seront effectués lorsque certaines étapes auront été franchies. Exemples :  \n            ▪ Rapports, comme ceux établis dans le cadre d'un processus opérationnel, rapports de gestion, rapports du conseil municipal ou rapports d'étape officiels  \n            ▪ Dessins de conception \n            ▪ Listes des participants aux ateliers\n            ▪ Procès-verbaux de réunions du conseil municipal ou de la direction\n            ▪ Articles de presse\n            ▪ Certificats de formation \n            ▪ Approbations provinciales ou municipales (p. ex., approbations environnementales, certificats d'exploitation)\n"]
["▪ DATES DE DÉBUT ET DE FIN : Indiquez les dates de début et de fin estimatives pour chaque étape. Remarque : Dans la plupart des cas, la Fédération canadienne des municipalités (FCM) s'attend à ce que les initiatives financées soient terminées dans les trois années suivant la date d'approbation. Il sera fait mention de cette exigence dans votre contrat avec la FCM.\n"]
["▪ TÂCHE : Une tâche est définie comme étant une activité unique entreprise en vue de mener à bien une étape. Pour chaque tâche énoncée, veuillez fournir une description de ce qu'implique la tâche et préciser qui la mènera à bien en plus de fournir une estimation du coût. En général, les tâches individuelles devraient coûter moins de 50 000 $. Les coûts devraient être ventilés en deux catégories : les coûts admissibles et les coûts non admissibles. Reportez-vous à l'onglet 2 (Coûts admissibles et non admissibles) pour obtenir la liste des coûts qui peuvent être partiellement remboursés par la FCM."]
["▪ COÛTS ÉVENTUELS : Les coûts éventuels sont des coûts admissibles, mais qui ne peuvent figurer dans une section séparée du budget. Répartissez les coûts éventuels dans les sections adéquates du budget s'il y a lieu et donnez une explication concernant le pourcentage ou le montant de ces coûts dans la section « Coûts éventuels » sous le tableau du plan de travail."]
["▪ TAXES : Vous pouvez inclure dans votre budget la partie des taxes pour laquelle votre organisation n'est pas admissible à un remboursement (provincial, territorial ou fédéral). Allouez ce montant aux tâches adéquates, s'il y a lieu. "]
["▪ SUPPRIMER DES LIGNES : Les lignes ne peuvent pas être supprimées en raison de la structure du modèle. Laissez les lignes supplémentaires vides."]
["▪ INFORMATION À METTRE À JOUR À CHAQUE DEMANDE DE CONTRIBUTION : Veuillez noter que les onglets 4 à 6 doivent être mis à jour (au besoin) chaque fois que vous présentez une demande de contribution au FMV. "]

{"sheet":"2. Coûts admissibles & non adm.","index":1,"n_rows":47,"n_cols":3,"rows_kept":47,"cut":false,"hidden":false,"merged":[]}
[null,"                                                                            Tableau des coûts admissibles et non admissibles"]
["                  Si votre demande est approuvée, les dépenses qui sont admissibles à un remboursement partiel ou à une contribution anticipée doivent : "]
["             – être engagées après la date à laquelle la FCM a reçu la demande (coûts de rédaction de la demande engagés jusqu'à 90 jours avant la réception de la demande par la FCM);"]
["             – être facturées directement à votre organisation;"]
["             – constituer un élément intégral et essentiel de l'initiative et être indispensable pour que l'objectif environnemental soit atteint;"]
["             – être raisonnables et réellement engagées conformément aux normes applicables dans l'industrie."]
["La FCM se réserve le droit de vérifier à une date ultérieure les états financiers ou les dépenses engagées. "]
["Veuillez conserver pendant au moins sept ans les comptes et documents financiers, par exemple, les contrats, les factures, les états financiers, les reçus, feuilles de temps et pièces."]
["Les documents financiers, notamment les coûts de la main-d'œuvre, doivent être documentés conformément aux normes d'audit et permettre la vérification de l'admissibilité des coûts et du niveau d'effort."]
["Catégorie de coûts","Coûts admissibles","Coûts non admissibles"]
["                                                                               Section A : Coûts engagés avant la date de réception de la demande par la FCM"]
["1) Avant la demande","Coûts engagés jusqu'à 90 jours avant la date de réception de la demande pour rédiger la demande au FMV","Tous les autres coûts engagés avant la date de réception de la demande"]
["                                                                             Section B : Coûts engagés après la date de réception de la demande par la FCM"]
["2)  Frais d'administration","Frais d'administration directement liés au projet et engagés à cette fin, par exemple :","Locaux à bureaux, fournitures et dépenses générales engagées dans le cours normal des activités"]
[null,"•         frais de communication (p. ex., appels interurbains) "]
[null,"•         certifications ou permis requis pour le projet"]
[null,"•       impression ou photocopie par des fournisseurs de l'extérieur"]
[null,"•         acquisition de documents utilisés exclusivement pour le projet"]
[null,"•         traduction de documents"]
["3)  Publicité","Frais de publicité essentiels pour faire connaître le projet au public et frais d'évaluation du projet, par exemple : ","•         Frais de publicité engagés à des fins de sensibilisation générale du public ou de publicité qui découlent des activités courantes ou d'autres activités opérationnelles et qui ne constituent pas une exigence particulière dans le cadre du projet"]
{"$rows_left_out":28}
{"sheet":"3. Budget - Plan de travail","index":2,"n_rows":171,"n_cols":8,"rows_kept":171,"cut":false,"hidden":false,"merged":[]}
["                                                                                                                                                                                            PLAN DE TRAVAIL ET BUDGET "]
["Demandeur principal :",null,null,null,"Type de demandeur (en sélectionner un)"]
["Titre du projet :",null,null,null,"Type de projet (en sélectionner un)"]
["Étapes","Date de début ","Date de fin ","Catégorie de coûts (en sélectionner une)","Coûts admissibles ($)","Coûts non admissibles ($)","Coût total ($)"]
["Étape 1 : Veuillez indiquer votre première étape","mm/aaaa","mm/aaaa"]
["Description de l'étape : [Dans cette case, veuillez décrire l'étape ou le livrable principal qui témoigne de l'achèvement de cette étape]"]
["[Ajouter la description de la tâche ici]",null,null,null,null,null,{"$f":"E7+F7","v":0}]
["[Ajouter la description de la tâche ici]",null,null,null,null,null,{"$f":"E8+F8","v":0}]
["[Ajouter la description de la tâche ici]",null,null,null,null,null,0]
["[Ajouter la description de la tâche ici]",null,null,null,null,null,0]
["[Ajouter la description de la tâche ici]",null,null,null,null,null,0]
["[Ajouter la description de la tâche ici]",null,null,null,null,null,0]
["[Ajouter la description de la tâche ici]",null,null,null,null,null,0]
["[Ajouter la description de la tâche ici]",null,null,null,null,null,0]
["[Ajouter la description de la tâche ici]",null,null,null,null,null,0]
["[Ajouter la description de la tâche ici]",null,null,null,null,null,0]
["[Ajouter la description de la tâche ici]",null,null,null,null,null,0]
["[Ajouter la description de la tâche ici]",null,null,null,null,null,0]
["[Ajouter la description de la tâche ici]",null,null,null,null,null,0]
["[Ajouter la description de la tâche ici]",null,null,null,null,null,{"$f":"E20+F20","v":0}]
{"$rows_left_out":152}
{"sheet":"4. Sources de financement","index":3,"n_rows":25,"n_cols":6,"rows_kept":25,"cut":false,"hidden":false,"merged":[]}
["INSTRUCTIONS\nInscrivez toutes les sources de financement pour cette initiative. Pour chaque source de financement, veuillez indiquer le montant du financement et le moment auquel il sera ou devrait être confirmé. Le total de toutes les sources de financement doit être égal aux coûts totaux du projet figurant dans votre Budget et plan de travail (onglet 3). \nLa contribution en espèces de l'administration municipale doit représenter au moins 10 % des coûts admissibles sauf s'il en a été décidé autrement par la FCM.  \nLa FCM imposera un plafond à la subvention du FMV en fonction des autres sources de financement confirmées.\n\nPlans et études de faisabilité\nLa FCM offre des subventions qui couvrent jusqu'à 50 % des coûts admissibles (jusqu'à concurrence de 175 000 $) en vue d'entreprendre les plans et études de faisabilité admissibles. \n\nProjets pilotes\nLa FCM offre des subventions qui couvrent jusqu'à 50 % des coûts admissibles (jusqu'à concurrence de 500 000 $) pour entreprendre les projets pilotes admissibles. Les municipalités comptant 20 000 habitants ou moins et leurs partenaires municipaux peuvent avoir droit à une subvention pour un projet pilote couvrant jusqu'à 80 % des coûts admissibles du projet dans certaines conditions. Communiquez avec nous pour déterminer si votre municipalité est admissible. "]
["SOURCES DE FINANCEMENT"]
["Source de financement","Description","Confirmée? (O/N)","Date de l'engagement\nJJ-MM-AAAA","Montant","Pourcentage du budget total"]
["Fonds municipal vert","Subvention","N",null,{"$f":"IF('3. Budget - Plan de travail'!G3=\"Projet Pilote\",IF(((0.5*'3. Budget - Plan de travail'!G121)>500000),500000,0.5*'3. Budget - Plan de travail'!G121),IF(((0.5*'3. Budget - Plan de travail'!G121)>175000),175000,0.5*'3. Budget - Plan de travail'!G121))","v":0},{"$f":"IFERROR(E4/$E$24,0)","v":0}]
[" Nom de la municipalité principale","Comptant",null,null,null,0]
["Autre source de financement ",null,null,null,null,0]
["Autre source de financement ",null,null,null,null,0]
["Autre source de financement ",null,null,null,null,0]
["Autre source de financement ",null,null,null,null,0]
["Autre source de financement ",null,null,null,null,0]
["Autre source de financement ",null,null,null,null,0]
["Autre source de financement ",null,null,null,null,0]
["Autre source de financement ",null,null,null,null,0]
["Autre source de financement ",null,null,null,null,0]
["Autre source de financement ",null,null,null,null,0]
["Autre source de financement ",null,null,null,null,0]
["Autre source de financement ",null,null,null,null,0]
["Autre source de financement ",null,null,null,null,0]
["Autre source de financement ",null,null,null,null,0]
["Autre source de financement ",null,null,null,null,0]
{"$rows_left_out":6}
{"sheet":"5. Tableau paiements & rapports","index":4,"n_rows":27,"n_cols":5,"rows_kept":27,"cut":false,"hidden":true,"merged":[[0,0,0,3],[1,4,1,7],[16,1,26,1],[16,2,26,2],[2,1,5,2],[7,3,15,3],[16,3,26,3],[1,1,1,2],[7,1,15,1],[7,2,15,2],[2,3,5,3]]}
["Tableau des paiements et des rapports"]
["Contribution(s) et livrable(s)","Date prévue de la contribution",null,"La contribution doit être égale à :","[EXEMPLE] : L'agent de projet doit insérer un tableau personnalisé"]
["Contribution anticipée no 1 ","Dans les 30 jours suivant la signature de la convention \n+\nle reçu d'un chèque annulé",null,"INSÉRER LE MONTANT CALCULÉ AU MOMENT DE L'APPROBATION DU PROJET) $"]
["•        Convention de subvention signé"]
["•         Chèque annulé"]
[]
["Contribution(s) et livrable(s)","Date de présentation approximative","Date approximative de la contribution","La contribution doit être égale au moindre des deux montants suivants :"]
["Contribution  no 2","INSÉRER LA DATE À LAQUELLE LE FVM S'ATTEND À RECEVOIR LA DEMANDE DÛMENT REMPLIE","INSÉRER LA DATE POSTÉRIEURE DE 30 JOURS À LA DATE DE LA PRÉSENTATION","$ INSÉRER LE MONTANT COMBINÉ DES CONTRIBUTIONS 1 ET 2, QUI DOIT REPRÉSENTER AU MAXIMUM 75 % DE LA SUBVENTION TOTALE moins le montant des contributions antérieures; ou\n\nINSÉRER 50 OU 80 TEL QU'INDIQUE DANS L'APPROBATION % des coûts admissibles alors engagés par le Bénéficiaire moins le montant de la contribution antérieure"]
["•         Annexe D – Demande de Contribution "]
["•        Annexe E – Rapport d'étape du projet"]
["•       PERTINENTS DU CARNET ont été menées à bien : INSÉRER LES LIVRABLES MENTIONNÉS DANS LE CARNET DE PROJET"]
["•         Carnet de projet mis à jour"]
["o    Sources de financement"]
["o    Calendrier des paiements et de présentation des rapports"]
["o    Demande de remboursement des dépenses"]
["•         Conditions supplémentaires : INSÉRER TOUTE CONDITION SUPPLÉMENTAIRE IMPOSÉE PAR LE PERSONNEL DU FMV, LE CONSEIL DU FMV OU LE CONSEIL D'ADMINISTRATION DE LA FCM OU ÉCRIRE Aucune "]
["Contribution finale","INSÉRER LA DATE À LAQUELLE LE FMV S'ATTEND À RECEVOIR LA DEMANDE DÛMENT REMPLIE","INSÉRER LA DATE POSTÉRIEURE DE 30 JOURS À LA DATE DE LA PRÉSENTATION","$ INSÉRER LE MONTANT TOTAL DE LA SUBVENTION moins le montant des contributions antérieures; ou\n\nINSÉRER 50 OU 80 TEL QU'INDIQUE DANS L'APPROBATION % des coûts admissibles alors engagés par le Bénéficiaire moins le total des contributions antérieures"]
["•         Annexe D – Demande de contribution "]
["•         Annexe F – Rapport d'achèvement du projet "]
["•         Preuve que les étapes INSÉRER LES NUMÉROS PERTINENTS DU CARNET ont été menées à bien : INSÉRER LES LIVRABLES MENTIONNÉS DANS LE CARNET DE PROJET"]
{"$rows_left_out":8}
{"sheet":"6. Demandes de remboursement","index":5,"n_rows":141,"n_cols":13,"rows_kept":141,"cut":false,"hidden":true,"merged":[]}
["                                                                                                                                                                                                      Demande de remboursement des dépenses  ̶  Initiatives menées dans le cadre du FMV"]
["Demandeur principal :",{"$f":"'3. Budget - Plan de travail'!B2","v":0},null,null,null,null,"Indiquez le taux de remboursement de la taxe ------->"]
["Titre du projet :",{"$f":"'3. Budget - Plan de travail'!B3","v":0}]
["                                                                                                         Coûts estimatifs du budget (tirés de l'onglet 3, Plan de travail et budget)",null,null,null,null,null,null,null,"                                                                                                                                                         Coûts réels du budget"]
["Étapes","Date de début ","Date de fin ","Catégorie de coûts","Coûts admissibles \n($)","Coûts non admissibles ($)","Coûts totaux prévus \n($)",null,"Coûts admissibles réels (déduction faite du remboursement de la taxe)","Coûts non admissibles réels (déduction faite du remboursement de la taxe)","Coûts réels totaux (déduction faite du remboursement de la taxe)","Commentaires du bénéficiaire","Commentaires du FMV"]
[{"$f":"'3. Budget - Plan de travail'!A5","v":"Étape 1 : Veuillez indiquer votre première étape"},{"$f":"'3. Budget - Plan de travail'!B5","v":"mm/aaaa"},{"$f":"'3. Budget - Plan de travail'!C5","v":"mm/aaaa"}]
[{"$f":"'3. Budget - Plan de travail'!A6","v":"Description de l'étape : [Dans cette case, veuillez décrire l'étape ou le livrable principal qui témoigne de l'achèvement de cette étape]"}]
[{"$f":"'3. Budget - Plan de travail'!A7:C7","v":"[Ajouter la description de la tâche ici]"},null,null,{"$f":"'3. Budget - Plan de travail'!D7","v":0},{"$f":"'3. Budget - Plan de travail'!E7","v":0},{"$f":"'3. Budget - Plan de travail'!F7","v":0},{"$f":"'3. Budget - Plan de travail'!G7","v":0},null,null,null,{"$f":"I8+J8","v":0}]
[{"$f":"'3. Budget - Plan de travail'!A8:C8","v":"[Ajouter la description de la tâche ici]"},null,null,{"$f":"'3. Budget - Plan de travail'!D8","v":0},{"$f":"'3. Budget - Plan de travail'!E8","v":0},{"$f":"'3. Budget - Plan de travail'!F8","v":0},{"$f":"'3. Budget - Plan de travail'!G8","v":0},null,null,null,{"$f":"I9+J9","v":0}]
[{"$f":"'3. Budget - Plan de travail'!A9:C9","v":"[Ajouter la description de la tâche ici]"},null,null,{"$f":"'3. Budget - Plan de travail'!D9","v":0},{"$f":"'3. Budget - Plan de travail'!E9","v":0},{"$f":"'3. Budget - Plan de travail'!F9","v":0},{"$f":"'3. Budget - Plan de travail'!G9","v":0},null,null,null,0]
[{"$f":"'3. Budget - Plan de travail'!A10:C10","v":"[Ajouter la description de la tâche ici]"},null,null,{"$f":"'3. Budget - Plan de travail'!D10","v":0},{"$f":"'3. Budget - Plan de travail'!E10","v":0},{"$f":"'3. Budget - Plan de travail'!F10","v":0},{"$f":"'3. Budget - Plan de travail'!G10","v":0},null,null,null,0]
[{"$f":"'3. Budget - Plan de travail'!A11:C11","v":"[Ajouter la description de la tâche ici]"},null,null,{"$f":"'3. Budget - Plan de travail'!D11","v":0},{"$f":"'3. Budget - Plan de travail'!E11","v":0},{"$f":"'3. Budget - Plan de travail'!F11","v":0},{"$f":"'3. Budget - Plan de travail'!G11","v":0},null,null,null,0]
[{"$f":"'3. Budget - Plan de travail'!A12:C12","v":"[Ajouter la description de la tâche ici]"},null,null,{"$f":"'3. Budget - Plan de travail'!D12","v":0},{"$f":"'3. Budget - Plan de travail'!E12","v":0},{"$f":"'3. Budget - Plan de travail'!F12","v":0},{"$f":"'3. Budget - Plan de travail'!G12","v":0},null,null,null,0]
[{"$f":"'3. Budget - Plan de travail'!A13:C13","v":"[Ajouter la description de la tâche ici]"},null,null,{"$f":"'3. Budget - Plan de travail'!D13","v":0},{"$f":"'3. Budget - Plan de travail'!E13","v":0},{"$f":"'3. Budget - Plan de travail'!F13","v":0},{"$f":"'3. Budget - Plan de travail'!G13","v":0},null,null,null,0]
[{"$f":"'3. Budget - Plan de travail'!A14:C14","v":"[Ajouter la description de la tâche ici]"},null,null,{"$f":"'3. Budget - Plan de travail'!D14","v":0},{"$f":"'3. Budget - Plan de travail'!E14","v":0},{"$f":"'3. Budget - Plan de travail'!F14","v":0},{"$f":"'3. Budget - Plan de travail'!G14","v":0},null,null,null,0]
[{"$f":"'3. Budget - Plan de travail'!A15:C15","v":"[Ajouter la description de la tâche ici]"},null,null,{"$f":"'3. Budget - Plan de travail'!D15","v":0},{"$f":"'3. Budget - Plan de travail'!E15","v":0},{"$f":"'3. Budget - Plan de travail'!F15","v":0},{"$f":"'3. Budget - Plan de travail'!G15","v":0},null,null,null,0]
[{"$f":"'3. Budget - Plan de travail'!A16:C16","v":"[Ajouter la description de la tâche ici]"},null,null,{"$f":"'3. Budget - Plan de travail'!D16","v":0},{"$f":"'3. Budget - Plan de travail'!E16","v":0},{"$f":"'3. Budget - Plan de travail'!F16","v":0},{"$f":"'3. Budget - Plan de travail'!G16","v":0},null,null,null,0]
[{"$f":"'3. Budget - Plan de travail'!A17:C17","v":"[Ajouter la description de la tâche ici]"},null,null,{"$f":"'3. Budget - Plan de travail'!D17","v":0},{"$f":"'3. Budget - Plan de travail'!E17","v":0},{"$f":"'3. Budget - Plan de travail'!F17","v":0},{"$f":"'3. Budget - Plan de travail'!G17","v":0},null,null,null,0]
[{"$f":"'3. Budget - Plan de travail'!A18:C18","v":"[Ajouter la description de la tâche ici]"},null,null,{"$f":"'3. Budget - Plan de travail'!D18","v":0},{"$f":"'3. Budget - Plan de travail'!E18","v":0},{"$f":"'3. Budget - Plan de travail'!F18","v":0},{"$f":"'3. Budget - Plan de travail'!G18","v":0},null,null,null,0]
[{"$f":"'3. Budget - Plan de travail'!A19:C19","v":"[Ajouter la description de la tâche ici]"},null,null,{"$f":"'3. Budget - Plan de travail'!D19","v":0},{"$f":"'3. Budget - Plan de travail'!E19","v":0},{"$f":"'3. Budget - Plan de travail'!F19","v":0},{"$f":"'3. Budget - Plan de travail'!G19","v":0},null,null,null,0]
{"$rows_left_out":121}